Reaction Details
TargetOrexin/Hypocretin receptor type 1
LigandBDBM401795
Substrate/Competitorn/a
Meas. Tech.FLIPR Ca2+ Flux Assay
IC50 31.3±n/a nM
Citation Liverton, NKuduk, SDBeshore, DLuo, YMeng, N Pyrazole, triazole and tetrazole orexin receptor antagonists US Patent US10010539 Publication Date 7/3/2018
 
Orexin/Hypocretin receptor type 1
Name:Orexin/Hypocretin receptor type 1
Type:Protein
Mol. Mass.:46817.55
Organism:Rattus norvegicus (Rat)
Description:P56718
Residue:416
BDBM401795
NameBDBM401795
Synonyms:(2-Ethoxyphenyl)((2R,5R)-5-(4-(2-hydroxypropan-2-yl)-2H-1,2,3-triazol-2-yl)-2-methylpiperi-din-1-yl)methanone | US10010539, 12
TypeSmall organic molecule
Emp. Form.C20H28N4O3
Mol. Mass.372.4613
SMILESCCOc1ccccc1C(=O)N1C[C@@H](CC[C@H]1C)n1ncc(n1)C(C)(C)O