Reaction Details
TargetOrexin/Hypocretin receptor type 1
LigandBDBM401801
Substrate/Competitorn/a
Meas. Tech.FLIPR Ca2+ Flux Assay
IC50 15.0±n/a nM
Citation Liverton, NKuduk, SDBeshore, DLuo, YMeng, N Pyrazole, triazole and tetrazole orexin receptor antagonists US Patent US10010539 Publication Date 7/3/2018
 
Orexin/Hypocretin receptor type 1
Name:Orexin/Hypocretin receptor type 1
Type:Protein
Mol. Mass.:46817.55
Organism:Rattus norvegicus (Rat)
Description:P56718
Residue:416
BDBM401801
NameBDBM401801
Synonyms:(2-(2,2-Difluoroethoxy)phenyl)((2R,5R)-5-(4-(2-hydroxypropan-2-yl)-2H-1,2,3-triazol-2-yl)-2-methylpiperidin-1-yl)methanone | US10010539, 18
TypeSmall organic molecule
Emp. Form.C20H26F2N4O3
Mol. Mass.408.4422
SMILESC[C@@H]1CC[C@H](CN1C(=O)c1ccccc1OCC(F)F)n1ncc(n1)C(C)(C)O