Reaction Details
TargetOrexin/Hypocretin receptor type 1
LigandBDBM401803
Substrate/Competitorn/a
Meas. Tech.FLIPR Ca2+ Flux Assay
IC50 24.6±n/a nM
Citation Liverton, NKuduk, SDBeshore, DLuo, YMeng, N Pyrazole, triazole and tetrazole orexin receptor antagonists US Patent US10010539 Publication Date 7/3/2018
 
Orexin/Hypocretin receptor type 1
Name:Orexin/Hypocretin receptor type 1
Type:Protein
Mol. Mass.:46817.55
Organism:Rattus norvegicus (Rat)
Description:P56718
Residue:416
BDBM401803
NameBDBM401803
Synonyms:Methyl 2-((2R,5R)-5-(4-(2-hydroxypropan-2-yl)-2H-1,2,3-triazol-2-yl)-2-methylpiperidine-1-carbonyl)benzoate | US10010539, 20
TypeSmall organic molecule
Emp. Form.C20H26N4O4
Mol. Mass.386.4448
SMILESCOC(=O)c1ccccc1C(=O)N1C[C@@H](CC[C@H]1C)n1ncc(n1)C(C)(C)O