Reaction Details
TargetOrexin/Hypocretin receptor type 1
LigandBDBM401804
Substrate/Competitorn/a
Meas. Tech.FLIPR Ca2+ Flux Assay
IC50 18.0±n/a nM
Citation Liverton, NKuduk, SDBeshore, DLuo, YMeng, N Pyrazole, triazole and tetrazole orexin receptor antagonists US Patent US10010539 Publication Date 7/3/2018
 
Orexin/Hypocretin receptor type 1
Name:Orexin/Hypocretin receptor type 1
Type:Protein
Mol. Mass.:46817.55
Organism:Rattus norvegicus (Rat)
Description:P56718
Residue:416
BDBM401804
NameBDBM401804
Synonyms:(2-(Difluoromethoxy)phenyl)((2R,5R)-5-(4-(2-hydroxypropan-2-yl)-2H-1,2,3-triazol-2-yl)-2-methylpiperidin-1-yl)methanone | US10010539, 21
TypeSmall organic molecule
Emp. Form.C19H24F2N4O3
Mol. Mass.394.4157
SMILESC[C@@H]1CC[C@H](CN1C(=O)c1ccccc1OC(F)F)n1ncc(n1)C(C)(C)O