Reaction Details
TargetOrexin/Hypocretin receptor type 1
LigandBDBM401805
Substrate/Competitorn/a
Meas. Tech.FLIPR Ca2+ Flux Assay
IC50 8.50±n/a nM
Citation Liverton, NKuduk, SDBeshore, DLuo, YMeng, N Pyrazole, triazole and tetrazole orexin receptor antagonists US Patent US10010539 Publication Date 7/3/2018
 
Orexin/Hypocretin receptor type 1
Name:Orexin/Hypocretin receptor type 1
Type:Protein
Mol. Mass.:46817.55
Organism:Rattus norvegicus (Rat)
Description:P56718
Residue:416
BDBM401805
NameBDBM401805
Synonyms:2-{2-[(3R,6R)-1-({2-[(1S)-2,2-difluorocyclopropyl]phenyl}carbonyl)-6-methylpiperidin-3-yl]-2H-1,2,3-triazol-4-yl}propan-2-ol | US10010539, 22
TypeSmall organic molecule
Emp. Form.C21H26F2N4O2
Mol. Mass.404.4535
SMILESC[C@@H]1CC[C@H](CN1C(=O)c1ccccc1[C@@H]1CC1(F)F)n1ncc(n1)C(C)(C)O