Reaction Details
TargetOrexin/Hypocretin receptor type 1
LigandBDBM401810
Substrate/Competitorn/a
Meas. Tech.FLIPR Ca2+ Flux Assay
IC50 17.9±n/a nM
Citation Liverton, NKuduk, SDBeshore, DLuo, YMeng, N Pyrazole, triazole and tetrazole orexin receptor antagonists US Patent US10010539 Publication Date 7/3/2018
 
Orexin/Hypocretin receptor type 1
Name:Orexin/Hypocretin receptor type 1
Type:Protein
Mol. Mass.:46817.55
Organism:Rattus norvegicus (Rat)
Description:P56718
Residue:416
BDBM401810
NameBDBM401810
Synonyms:(2-(2H-1,2,3-triazol-2-yl)phenyl)((2R,5R)-2-methyl-5-(4-((R)-2,2,2-trifluoro-1-hydroxyethyl)-2H-1,2,3-triazol-2-yl)piperidin-1-yl)methanone | US10010539, 27
TypeSmall organic molecule
Emp. Form.C19H20F3N7O2
Mol. Mass.435.403
SMILESC[C@@H]1CC[C@H](CN1C(=O)c1ccccc1-n1nccn1)n1ncc(n1)[C@@H](O)C(F)(F)F