Reaction Details
TargetOrexin/Hypocretin receptor type 1
LigandBDBM401823
Substrate/Competitorn/a
Meas. Tech.FLIPR Ca2+ Flux Assay
IC50 27.1±n/a nM
Citation Liverton, NKuduk, SDBeshore, DLuo, YMeng, N Pyrazole, triazole and tetrazole orexin receptor antagonists US Patent US10010539 Publication Date 7/3/2018
 
Orexin/Hypocretin receptor type 1
Name:Orexin/Hypocretin receptor type 1
Type:Protein
Mol. Mass.:46817.55
Organism:Rattus norvegicus (Rat)
Description:P56718
Residue:416
BDBM401823
NameBDBM401823
Synonyms:2-{2-[(3R,6R)-1-{[4-fluoro-2-(2H-1,2,3- triazol-2-yl)phenyl]carbonyl}-6- methylpiperidin-3-yl]-2H-1,2,3-triazol-4- yl}propan-2-ol | US10010539, 39
TypeSmall organic molecule
Emp. Form.C20H24FN7O2
Mol. Mass.413.4487
SMILESC[C@@H]1CC[C@H](CN1C(=O)c1ccc(F)cc1-n1nccn1)n1ncc(n1)C(C)(C)O