Reaction Details
TargetOrexin/Hypocretin receptor type 1
LigandBDBM401846
Substrate/Competitorn/a
Meas. Tech.FLIPR Ca2+ Flux Assay
IC50 12.5±n/a nM
Citation Liverton, NKuduk, SDBeshore, DLuo, YMeng, N Pyrazole, triazole and tetrazole orexin receptor antagonists US Patent US10010539 Publication Date 7/3/2018
 
Orexin/Hypocretin receptor type 1
Name:Orexin/Hypocretin receptor type 1
Type:Protein
Mol. Mass.:46817.55
Organism:Rattus norvegicus (Rat)
Description:P56718
Residue:416
BDBM401846
NameBDBM401846
Synonyms:2-{5-Methyl-2-[(3R,6R)-6-methyl-1-{[2-(2H-1,2,3-triazol-2-yl)phenyl]carbonyl}piperidin-3-yl]-2H-1,2,3-triazol-4-yl}propan-2-ol | US10010539, 62
TypeSmall organic molecule
Emp. Form.C21H27N7O2
Mol. Mass.409.4848
SMILESC[C@@H]1CC[C@H](CN1C(=O)c1ccccc1-n1nccn1)n1nc(C)c(n1)C(C)(C)O