Reaction Details
TargetOrexin/Hypocretin receptor type 1
LigandBDBM401847
Substrate/Competitorn/a
Meas. Tech.FLIPR Ca2+ Flux Assay
IC50 15.9±n/a nM
Citation Liverton, NKuduk, SDBeshore, DLuo, YMeng, N Pyrazole, triazole and tetrazole orexin receptor antagonists US Patent US10010539 Publication Date 7/3/2018
 
Orexin/Hypocretin receptor type 1
Name:Orexin/Hypocretin receptor type 1
Type:Protein
Mol. Mass.:46817.55
Organism:Rattus norvegicus (Rat)
Description:P56718
Residue:416
BDBM401847
NameBDBM401847
Synonyms:2-{5-Methyl-2-[(3R,6R)-6-methyl-1-{[2-(1-methylethoxy)pyridin-3-yl]carbonyl}piperidin-3-yl]-2H-1,2,3-triazol-4-yl}propan-2-ol | US10010539, 63
TypeSmall organic molecule
Emp. Form.C21H31N5O3
Mol. Mass.401.5025
SMILESCC(C)Oc1ncccc1C(=O)N1C[C@@H](CC[C@H]1C)n1nc(C)c(n1)C(C)(C)O