Reaction Details
TargetOrexin/Hypocretin receptor type 1
LigandBDBM401848
Substrate/Competitorn/a
Meas. Tech.FLIPR Ca2+ Flux Assay
IC50 8.80±n/a nM
Citation Liverton, NKuduk, SDBeshore, DLuo, YMeng, N Pyrazole, triazole and tetrazole orexin receptor antagonists US Patent US10010539 Publication Date 7/3/2018
 
Orexin/Hypocretin receptor type 1
Name:Orexin/Hypocretin receptor type 1
Type:Protein
Mol. Mass.:46817.55
Organism:Rattus norvegicus (Rat)
Description:P56718
Residue:416
BDBM401848
NameBDBM401848
Synonyms:2-{2-[(3R,6R)-1-{[2-(2,2- Difluoroethoxy)pyridin-3- yl]carbonyl}-6-methylpiperidin-3- yl]-5-methyl-2H-1,2,3-triazol-4- yl}propan-2-ol | US10010539, 64
TypeSmall organic molecule
Emp. Form.C20H27F2N5O3
Mol. Mass.423.4569
SMILESC[C@@H]1CC[C@H](CN1C(=O)c1cccnc1OCC(F)F)n1nc(C)c(n1)C(C)(C)O