Reaction Details
TargetOrexin/Hypocretin receptor type 1
LigandBDBM401849
Substrate/Competitorn/a
Meas. Tech.FLIPR Ca2+ Flux Assay
IC50 15.1±n/a nM
Citation Liverton, NKuduk, SDBeshore, DLuo, YMeng, N Pyrazole, triazole and tetrazole orexin receptor antagonists US Patent US10010539 Publication Date 7/3/2018
 
Orexin/Hypocretin receptor type 1
Name:Orexin/Hypocretin receptor type 1
Type:Protein
Mol. Mass.:46817.55
Organism:Rattus norvegicus (Rat)
Description:P56718
Residue:416
BDBM401849
NameBDBM401849
Synonyms:2-(2-{(3R,6R)-1-[(2- Ethoxypyridin-3-yl)carbonyl]-6- methylpiperidin-3-yl}-5-methyl- 2H-1,2,3-triazol-4-yl)propan-2-ol | US10010539, 65
TypeSmall organic molecule
Emp. Form.C20H29N5O3
Mol. Mass.387.476
SMILESCCOc1ncccc1C(=O)N1C[C@@H](CC[C@H]1C)n1nc(C)c(n1)C(C)(C)O