Reaction Details
TargetOrexin/Hypocretin receptor type 1
LigandBDBM401853
Substrate/Competitorn/a
Meas. Tech.FLIPR Ca2+ Flux Assay
IC50 7.90±n/a nM
Citation Liverton, NKuduk, SDBeshore, DLuo, YMeng, N Pyrazole, triazole and tetrazole orexin receptor antagonists US Patent US10010539 Publication Date 7/3/2018
 
Orexin/Hypocretin receptor type 1
Name:Orexin/Hypocretin receptor type 1
Type:Protein
Mol. Mass.:46817.55
Organism:Rattus norvegicus (Rat)
Description:P56718
Residue:416
BDBM401853
NameBDBM401853
Synonyms:2-(2-{(3R,6R)-1-[(2- Ethoxyphenyl)carbonyl]-6- methylpiperidin-3-yl}-5-methyl- 2H-1,2,3-triazol-4-yl)propan-2-ol | US10010539, 69
TypeSmall organic molecule
Emp. Form.C21H30N4O3
Mol. Mass.386.4879
SMILESCCOc1ccccc1C(=O)N1C[C@@H](CC[C@H]1C)n1nc(C)c(n1)C(C)(C)O