Reaction Details
TargetOrexin/Hypocretin receptor type 1
LigandBDBM401857
Substrate/Competitorn/a
Meas. Tech.FLIPR Ca2+ Flux Assay
IC50 17.4±n/a nM
Citation Liverton, NKuduk, SDBeshore, DLuo, YMeng, N Pyrazole, triazole and tetrazole orexin receptor antagonists US Patent US10010539 Publication Date 7/3/2018
 
Orexin/Hypocretin receptor type 1
Name:Orexin/Hypocretin receptor type 1
Type:Protein
Mol. Mass.:46817.55
Organism:Rattus norvegicus (Rat)
Description:P56718
Residue:416
BDBM401857
NameBDBM401857
Synonyms:2-(5-Methyl-2-{(3R,6R)-6- methyl-1-[(2-phenylpyridin-3- yl)carbonyl]piperidin-3-yl}-2H- 1,2,3-triazol-4-yl)propan-2-ol | US10010539, 73
TypeSmall organic molecule
Emp. Form.C24H29N5O2
Mol. Mass.419.5194
SMILESC[C@@H]1CC[C@H](CN1C(=O)c1cccnc1-c1ccccc1)n1nc(C)c(n1)C(C)(C)O