Reaction Details
TargetOrexin/Hypocretin receptor type 1
LigandBDBM401859
Substrate/Competitorn/a
Meas. Tech.FLIPR Ca2+ Flux Assay
IC50 21.6±n/a nM
Citation Liverton, NKuduk, SDBeshore, DLuo, YMeng, N Pyrazole, triazole and tetrazole orexin receptor antagonists US Patent US10010539 Publication Date 7/3/2018
 
Orexin/Hypocretin receptor type 1
Name:Orexin/Hypocretin receptor type 1
Type:Protein
Mol. Mass.:46817.55
Organism:Rattus norvegicus (Rat)
Description:P56718
Residue:416
BDBM401859
NameBDBM401859
Synonyms:2-{1-[(3R,6R)-6-Methyl-1-{[2-(2H-1,2,3-triazol-2-yl)phenyl]carbonyl}piperidin-3-yl]-1H-pyrazol-4-yl}propan-2-ol | US10010539, 75
TypeSmall organic molecule
Emp. Form.C21H26N6O2
Mol. Mass.394.4701
SMILESC[C@@H]1CC[C@H](CN1C(=O)c1ccccc1-n1nccn1)n1cc(cn1)C(C)(C)O