Reaction Details
TargetOrexin/Hypocretin receptor type 1
LigandBDBM401862
Substrate/Competitorn/a
Meas. Tech.FLIPR Ca2+ Flux Assay
IC50 25.5±n/a nM
Citation Liverton, NKuduk, SDBeshore, DLuo, YMeng, N Pyrazole, triazole and tetrazole orexin receptor antagonists US Patent US10010539 Publication Date 7/3/2018
 
Orexin/Hypocretin receptor type 1
Name:Orexin/Hypocretin receptor type 1
Type:Protein
Mol. Mass.:46817.55
Organism:Rattus norvegicus (Rat)
Description:P56718
Residue:416
BDBM401862
NameBDBM401862
Synonyms:2-(1-{(3R,6R)-1-[(2- Cyclopropylphenyl)carbonyl]-6- methylpiperidin-3-yl}-1H- pyrazol-4-yl)propan-2-ol | US10010539, 78
TypeSmall organic molecule
Emp. Form.C22H29N3O2
Mol. Mass.367.4846
SMILESC[C@@H]1CC[C@H](CN1C(=O)c1ccccc1C1CC1)n1cc(cn1)C(C)(C)O