Reaction Details
TargetOrexin/Hypocretin receptor type 1
LigandBDBM401869
Substrate/Competitorn/a
Meas. Tech.FLIPR Ca2+ Flux Assay
IC50 9.40±n/a nM
Citation Liverton, NKuduk, SDBeshore, DLuo, YMeng, N Pyrazole, triazole and tetrazole orexin receptor antagonists US Patent US10010539 Publication Date 7/3/2018
 
Orexin/Hypocretin receptor type 1
Name:Orexin/Hypocretin receptor type 1
Type:Protein
Mol. Mass.:46817.55
Organism:Rattus norvegicus (Rat)
Description:P56718
Residue:416
BDBM401869
NameBDBM401869
Synonyms:2-{1-[(3R,6R)-1-({2-[(1S)-2,2- Difluorocyclopropyl]phenyl}carbonyl)- 6-methylpiperidin-3-yl]-1H- pyrazol-4-yl}propan-2-ol | US10010539, 85
TypeSmall organic molecule
Emp. Form.C22H27F2N3O2
Mol. Mass.403.4655
SMILESC[C@@H]1CC[C@H](CN1C(=O)c1ccccc1[C@@H]1CC1(F)F)n1cc(cn1)C(C)(C)O