Reaction Details
TargetOrexin/Hypocretin receptor type 1
LigandBDBM401872
Substrate/Competitorn/a
Meas. Tech.FLIPR Ca2+ Flux Assay
IC50 15.2±n/a nM
Citation Liverton, NKuduk, SDBeshore, DLuo, YMeng, N Pyrazole, triazole and tetrazole orexin receptor antagonists US Patent US10010539 Publication Date 7/3/2018
 
Orexin/Hypocretin receptor type 1
Name:Orexin/Hypocretin receptor type 1
Type:Protein
Mol. Mass.:46817.55
Organism:Rattus norvegicus (Rat)
Description:P56718
Residue:416
BDBM401872
NameBDBM401872
Synonyms:2-{1-[(3R,6R)-6-Methyl-1-({2- [(trifluoromethyl)sulfanyl]phenyl} carbonyl)piperidin-3-yl]-1H-pyrazol-4- yl}propan-2-ol | US10010539, 88
TypeSmall organic molecule
Emp. Form.C20H24F3N3O2S
Mol. Mass.427.484
SMILESC[C@@H]1CC[C@H](CN1C(=O)c1ccccc1SC(F)(F)F)n1cc(cn1)C(C)(C)O