Reaction Details
TargetOrexin/Hypocretin receptor type 1
LigandBDBM401889
Substrate/Competitorn/a
Meas. Tech.FLIPR Ca2+ Flux Assay
IC50 9.40±n/a nM
Citation Liverton, NKuduk, SDBeshore, DLuo, YMeng, N Pyrazole, triazole and tetrazole orexin receptor antagonists US Patent US10010539 Publication Date 7/3/2018
 
Orexin/Hypocretin receptor type 1
Name:Orexin/Hypocretin receptor type 1
Type:Protein
Mol. Mass.:46817.55
Organism:Rattus norvegicus (Rat)
Description:P56718
Residue:416
BDBM401889
NameBDBM401889
Synonyms:(2R)-1,1,1-Trifluoro-2-{1-[(3R,6R)-6-methyl-1-{[2-(2H-1,2,3-triazol-2-yl)phenyl]carbonyl}piperidin-3-yl]-1H-pyrazol-4-yl}propan-2-ol | US10010539, 105
TypeSmall organic molecule
Emp. Form.C21H23F3N6O2
Mol. Mass.448.4415
SMILESC[C@@H]1CC[C@H](CN1C(=O)c1ccccc1-n1nccn1)n1cc(cn1)[C@@](C)(O)C(F)(F)F