Reaction Details
TargetOrexin/Hypocretin receptor type 1
LigandBDBM401890
Substrate/Competitorn/a
Meas. Tech.FLIPR Ca2+ Flux Assay
IC50 10.6±n/a nM
Citation Liverton, NKuduk, SDBeshore, DLuo, YMeng, N Pyrazole, triazole and tetrazole orexin receptor antagonists US Patent US10010539 Publication Date 7/3/2018
 
Orexin/Hypocretin receptor type 1
Name:Orexin/Hypocretin receptor type 1
Type:Protein
Mol. Mass.:46817.55
Organism:Rattus norvegicus (Rat)
Description:P56718
Residue:416
BDBM401890
NameBDBM401890
Synonyms:US10010539, 106
TypeSmall organic molecule
Emp. Form.C21H23F3N6O2
Mol. Mass.448.4415
SMILESC[C@@H]1CC[C@H](CN1C(=O)c1ccccc1-n1nccn1)n1cc(cn1)[C@](C)(O)C(F)(F)F