Reaction Details
TargetCarbonic anhydrase 2
LigandBDBM35732
Substrate/CompetitorBDBM10856
Meas. Tech.CA Inhibition Assay
pH7.4±n/a
Temperature298.15±n/a K
Ki 51±n/a nM
Citation Güzel, OInnocenti, AScozzafava, ASalman, ASupuran, CT Carbonic anhydrase inhibitors. Aromatic/heterocyclic sulfonamides incorporating phenacetyl, pyridylacetyl and thienylacetyl tails act as potent inhibitors of human mitochondrial isoforms VA and VB. Bioorg Med Chem17:4894-9 (2009) 
 
Carbonic anhydrase 2
Name:Carbonic anhydrase 2
Type:Enzyme
Mol. Mass.:29250.71
Organism:Homo sapiens (Human)
Description:P00918
Residue:260
BDBM35732
BDBM10856
NameBDBM35732
Synonyms:sulfonamide deriv., 6
TypeSmall organic molecule
Emp. Form.C8H8N4O3S3
Mol. Mass.304.369
SMILESNS(=O)(=O)c1nnc(NC(=O)Cc2cccs2)s1