Reaction Details
TargetCarbonic anhydrase 5A, mitochondrial
LigandBDBM35737
Substrate/CompetitorBDBM10856
Meas. Tech.CA Inhibition Assay
Temperature298.15±n/a K
Ki 8.2±n/a nM
Commentsextracted
Citation Güzel, OInnocenti, AScozzafava, ASalman, ASupuran, CT Carbonic anhydrase inhibitors. Aromatic/heterocyclic sulfonamides incorporating phenacetyl, pyridylacetyl and thienylacetyl tails act as potent inhibitors of human mitochondrial isoforms VA and VB. Bioorg Med Chem17:4894-9 (2009) 
 
Carbonic anhydrase 5A, mitochondrial
Name:Carbonic anhydrase 5A, mitochondrial
Type:Enzyme
Mol. Mass.:34755.54
Organism:Homo sapiens (Human)
Description:Human (cloned) isozyme
Residue:305
BDBM35737
BDBM10856
NameBDBM35737
Synonyms:sulfonamide deriv., 7e
TypeSmall organic molecule
Emp. Form.C14H13ClN2O3S
Mol. Mass.324.783
SMILESNS(=O)(=O)c1ccc(NC(=O)Cc2ccccc2)c(Cl)c1