Reaction Details
TargetAdenosine receptor A2a
LigandBDBM35836
Substrate/CompetitorBDBM35804
Meas. Tech.Radioligand Binding Assay
Ki 1±n/a nM
Citation Gillespie, RJBamford, SJClay, AGaur, SHaymes, TJackson, PSJordan, AMKlenke, BLeonardi, SLiu, JMansell, HLNg, SSaadi, MSimmonite, HStratton, GCTodd, RSWilliamson, DSYule, IA Antagonists of the human A(2A) receptor. Part 6: Further optimization of pyrimidine-4-carboxamides. Bioorg Med Chem17:6590-605 (2009) 
 
Adenosine receptor A2a
Name:Adenosine receptor A2a
Type:G Protein-Coupled Receptor (GPCR)
Mol. Mass.:44716.46
Organism:Homo sapiens (Human)
Description:P29274
Residue:412
BDBM35836
BDBM35804
NameBDBM35836
Synonyms:pyrimidine-4-carboxamide, 118
TypeSmall organic molecule
Emp. Form.C14H14N6O2
Mol. Mass.298.3
SMILESCc1ccc(o1)-c1cc(nc(N)n1)C(=O)NCc1ncc[nH]1