Reaction Details
TargetAdenosine receptor A2b
LigandBDBM35834
Substrate/CompetitorBDBM10852
Meas. Tech.Radioligand Binding Assay
Ki>10000±n/a nM
Citation Gillespie, RJBamford, SJClay, AGaur, SHaymes, TJackson, PSJordan, AMKlenke, BLeonardi, SLiu, JMansell, HLNg, SSaadi, MSimmonite, HStratton, GCTodd, RSWilliamson, DSYule, IA Antagonists of the human A(2A) receptor. Part 6: Further optimization of pyrimidine-4-carboxamides. Bioorg Med Chem17:6590-605 (2009) 
 
Adenosine receptor A2b
Name:Adenosine receptor A2b
Type:G Protein-Coupled Receptor (GPCR)
Mol. Mass.:36341.22
Organism:Homo sapiens (Human)
Description:n/a
Residue:332
BDBM35834
BDBM10852
NameBDBM35834
Synonyms:pyrimidine-4-carboxamide, 116
TypeSmall organic molecule
Emp. Form.C15H15N5O2
Mol. Mass.297.3119
SMILESCc1ccc(o1)-c1cc(nc(N)n1)C(=O)NCc1ccc[nH]1