Reaction Details
TargetPhosphatidylinositol 4,5-bisphosphate 3-kinase catalytic subunit beta isoform
LigandBDBM50192886
Substrate/Competitorn/a
Meas. Tech.PI3-Kinase HTRF Assay
IC50 2000±n/a nM
Citation Castro, ACEvans, CAJanardanannair, SLescarbeau, ALiu, TTremblay, MR Heterocyclic compounds and uses thereof US Patent US10329299 Publication Date 6/25/2019
 
Phosphatidylinositol 4,5-bisphosphate 3-kinase catalytic subunit beta isoform
Name:Phosphatidylinositol 4,5-bisphosphate 3-kinase catalytic subunit beta isoform
Type:Enzyme Subunit
Mol. Mass.:122769.00
Organism:Homo sapiens (Human)
Description:P42338
Residue:1070
BDBM50192886
NameBDBM50192886
Synonyms:CHEMBL3946030 US10675286, Compound 70 | US9775844, Compound 70
TypeSmall organic molecule
Emp. Form.C27H24N6O2
Mol. Mass.464.5185
SMILESC\C=C\c1cccc2cc([C@H](C)NC(=O)c3c(N)nn4cccnc34)n(-c3ccccc3)c(=O)c12