Reaction Details
Target5-hydroxytryptamine receptor 2A
LigandBDBM35926
Substrate/CompetitorBDBM21395
Meas. Tech.Radioligand Binding Assay
pH7.4±n/a
Temperature296.15±n/a K
Ki 32±n/a nM
Citation Shah, JRMosier, PDRoth, BLKellogg, GEWestkaemper, RB Synthesis, structure-affinity relationships, and modeling of AMDA analogs at 5-HT2A and H1 receptors: structural factors contributing to selectivity. Bioorg Med Chem17:6496-504 (2009) 
 
5-hydroxytryptamine receptor 2A
Name:5-hydroxytryptamine receptor 2A
Type:undefined
Mol. Mass.:52607.65
Organism:Homo sapiens (Human)
Description:P28223
Residue:471
BDBM35926
BDBM21395
NameBDBM35926
Synonyms:3-(9,10-Dihydro-anthracen-9-yl)-propylamine 9-(2-aminopropyl)-9,10-dihydroanthracene | CHEMBL158780
TypeSmall organic molecule
Emp. Form.C17H19N
Mol. Mass.237.3395
SMILESNCCCC1c2ccccc2Cc2ccccc12