Reaction Details
TargetCarbonic anhydrase 2
LigandBDBM36001
Substrate/Competitorn/a
Meas. Tech.SPR biosensor assay Biacore T100
pH7.4±0
Temperature298.15±0 K
Kd 10800±0 nM
KOFF 18800 s-1
KON 0.2031 M-1s-1
Citation Navratilova, IHopkins, AL Fragment Screening by Surface Plasmon Resonance ACS Med Chem Lett1:44-8 (2010)  
 
Carbonic anhydrase 2
Name:Carbonic anhydrase 2
Type:Enzyme Catalytic Domain
Mol. Mass.:29115.93
Organism:Bos taurus
Description:n/a
Residue:260
BDBM36001
NameBDBM36001
Synonyms:6-aminopyridine-3-sulfonamide | SPR_5
TypeSmall organic molecule
Emp. Form.C5H7N3O2S
Mol. Mass.173.193
SMILESNc1ccc(cn1)S(N)(=O)=O