Reaction Details
TargetCarbonic anhydrase 2
LigandBDBM36003
Substrate/Competitorn/a
Meas. Tech.SPR biosensor assay Biacore T100
pH7.4±n/a
Temperature298.15±n/a K
Kd 35300±n/a nM
KOFF 4650 s-1
KON 0.164 M-1s-1
Citation Navratilova, IHopkins, AL Fragment Screening by Surface Plasmon Resonance ACS Med Chem Lett1:44-8 (2010)  
 
Carbonic anhydrase 2
Name:Carbonic anhydrase 2
Type:Enzyme Catalytic Domain
Mol. Mass.:29115.93
Organism:Bos taurus
Description:n/a
Residue:260
BDBM36003
NameBDBM36003
Synonyms:1-methyl-1H-imidazole-4-sulfonamide | SPR_7
TypeSmall organic molecule
Emp. Form.C4H7N3O2S
Mol. Mass.161.182
SMILESCn1cnc(c1)S(N)(=O)=O