Reaction Details
TargetCarbonic anhydrase 2
LigandBDBM36005
Substrate/Competitorn/a
Meas. Tech.SPR biosensor assay Biacore T100
pH7.4±n/a
Temperature298.15±n/a K
Kd 3110±n/a nM
KOFF 18800 s-1
KON 0.0585 M-1s-1
Citation Navratilova, IHopkins, AL Fragment Screening by Surface Plasmon Resonance ACS Med Chem Lett1:44-8 (2010)  
 
Carbonic anhydrase 2
Name:Carbonic anhydrase 2
Type:Enzyme Catalytic Domain
Mol. Mass.:29115.93
Organism:Bos taurus
Description:n/a
Residue:260
BDBM36005
NameBDBM36005
Synonyms:2,3-dihydro-1H-indole-5-sulfonamide | SPR_9
TypeSmall organic molecule
Emp. Form.C8H10N2O2S
Mol. Mass.198.242
SMILESNS(=O)(=O)c1ccc2NCCc2c1