Reaction Details
TargetCalcium-dependent protein kinase 1
LigandBDBM36336
Substrate/Competitorn/a
Meas. Tech.Parasite Proliferation Assay
pH7.5±0
Temperature297.15±0 K
EC50 230±0.0 nM
Citation Kato, NSakata, TBreton, GLe Roch, KGNagle, AAndersen, CBursulaya, BHenson, KJohnson, JKumar, KAMarr, FMason, DMcNamara, CPlouffe, DRamachandran, VSpooner, MTuntland, TZhou, YPeters, ECChatterjee, ASchultz, PGWard, GEGray, NHarper, JWinzeler, EA Gene expression signatures and small-molecule compounds link a protein kinase to Plasmodium falciparum motility. Nat Chem Biol4:347-56 (2008) 
 
Calcium-dependent protein kinase 1
Name:Calcium-dependent protein kinase 1
Type:PROTEIN
Mol. Mass.:60804.87
Organism:Plasmodium Falciparum
Description:P62343
Residue:524
BDBM36336
NameBDBM36336
Synonyms:CID24762166 | Purfalcamine, 1
TypeSmall organic molecule
Emp. Form.C29H33FN8O
Mol. Mass.528.6237
SMILESN[C@H]1CC[C@@H](CC1)Nc1nc(Nc2ccc(cc2)C(=O)N2CCCCC2)c2ncn(-c3cccc(F)c3)c2n1