Reaction Details
TargetDNA-dependent protein kinase catalytic subunit
LigandBDBM36410
Substrate/Competitorn/a
Meas. Tech.PI3K Inhibition Assay
IC50 53±n/a nM
Citation Apsel, BBlair, JAGonzalez, BNazif, TMFeldman, MEAizenstein, BHoffman, RWilliams, RLShokat, KMKnight, ZA Targeted polypharmacology: discovery of dual inhibitors of tyrosine and phosphoinositide kinases. Nat Chem Biol4:691-9 (2008) 
 
DNA-dependent protein kinase catalytic subunit
Name:DNA-dependent protein kinase catalytic subunit
Type:Protein
Mol. Mass.:469114.78
Organism:Homo sapiens (Human)
Description:P78527
Residue:4128
BDBM36410
NameBDBM36410
Synonyms:1-cyclopentyl-3-(H-imidazo[1,2-a]pyridin-7-yl)-1H-pyrazolo[3,4-d]pyrimidin-4-amine, PP162 | CID24905148
TypeSmall organic molecule
Emp. Form.C17H17N7
Mol. Mass.319.3638
SMILESNc1ncnc2n(nc(-c3ccn4ccnc4c3)c12)C1CCCC1