Reaction Details
TargetPhosphatidylinositol 4,5-bisphosphate 3-kinase catalytic subunit delta isoform/Serine/threonine-protein kinase mTOR
LigandBDBM36411
Substrate/Competitorn/a
Meas. Tech.PI3K Inhibition Assay
IC50>5.0e+4±n/a nM
Citation Apsel, BBlair, JAGonzalez, BNazif, TMFeldman, MEAizenstein, BHoffman, RWilliams, RLShokat, KMKnight, ZA Targeted polypharmacology: discovery of dual inhibitors of tyrosine and phosphoinositide kinases. Nat Chem Biol4:691-9 (2008) 
 
Phosphatidylinositol 4,5-bisphosphate 3-kinase catalytic subunit delta isoform/Serine/threonine-protein kinase mTOR
Name:Phosphatidylinositol 4,5-bisphosphate 3-kinase catalytic subunit delta isoform/Serine/threonine-protein kinase mTOR
Type:Complex
Mol. Mass.:n/a
Description:n/a
Components:This complex has 2 components.
Component 1
Name:Serine/threonine-protein kinase mTOR
Synonyms:FK506-binding protein 12-rapamycin complex-associated protein 1 FRAP FRAP1 MTOR Mammalian Target of Rapamycin (mTOR) RAFT1 Rapamycin and FKBP12 target 1 Serine/threonine-protein kinase (mTOR) | mTORC2
Type:Rapamycin target protein
Mol. Mass.:288917.12
Organism:Homo sapiens (Human)
Description:P42345
Residue:2549
Component 2
Name:Phosphatidylinositol 4,5-bisphosphate 3-kinase catalytic subunit delta isoform
Synonyms:PI3-kinase p110 subunit delta PI3-kinase subunit p110-delta PIK3CD Phosphatidylinositol 4,5-biphosphate 3-kinase catalytic subunit delta (PIK3CD) Phosphatidylinositol 4,5-bisphosphate 3-kinase 110 kDa catalytic subunit delta (PI3K delta) Phosphatidylinositol 4,5-bisphosphate 3-kinase catalytic subunit delta (PI3Kdelta) Phosphatidylinositol 4,5-bisphosphate 3-kinase catalytic subunit delta isoform (PI3K delta) Phosphatidylinositol 4,5-bisphosphate 3-kinase catalytic subunit delta isoform (PI3K-delta) Phosphatidylinositol 4,5-bisphosphate 3-kinase catalytic subunit delta isoform (PI3Kdelta)
Type:Enzyme Subunit
Mol. Mass.:119489.41
Organism:Homo sapiens (Human)
Description:O00329
Residue:1044
BDBM36411
NameBDBM36411
Synonyms:2-((4-amino-3-(3-hydroxyphenyl)-1H-pyrazolo[3,4-d]pyrimidin-1-yl)methyl)-5-methyl-3-o-tolylquinazolin-4(3H)-one, PIK294 PIK294
TypeSmall organic molecule
Emp. Form.C28H23N7O2
Mol. Mass.489.5279
SMILESCc1ccccc1-n1c(Cn2nc(-c3cccc(O)c3)c3c(N)ncnc23)nc2cccc(C)c2c1=O