Reaction Details
TargetHistone deacetylase 4
LigandBDBM36484
Substrate/Competitorn/a
Meas. Tech.HDAC Enzyme Activity Assay
pH7.4±0
Temperature273.15±n/a K
IC50 642.7±n/a nM
Citation Bradner, JEWest, NGrachan, MLGreenberg, EFHaggarty, SJWarnow, TMazitschek, R Chemical phylogenetics of histone deacetylases. Nat Chem Biol6:238-243 (2010) 
 
Histone deacetylase 4
Name:Histone deacetylase 4
Type:Enzyme
Mol. Mass.:119049.39
Organism:Homo sapiens (Human)
Description:P56524
Residue:1084
BDBM36484
NameBDBM36484
Synonyms:(S)-Benzyl (6-acetamido-1-((4-methyl-2-oxo-2H-chromen-7-yl)amino)-1-oxohexan-2-yl)carbamate, 21 | CID10435243
TypeSmall organic molecule
Emp. Form.C26H29N3O6
Mol. Mass.479.525
SMILESCC(=O)NCCCC[C@H](NC(=O)OCc1ccccc1)C(=O)Nc1ccc2c(C)cc(=O)oc2c1