Reaction Details
TargetThyroid hormone receptor beta
LigandBDBM36487
Substrate/Competitorn/a
Meas. Tech.Competition Binding Assay
Kd 1.7±0.3 nM
Citation Ocasio, CAScanlan, TS Design and characterization of a thyroid hormone receptor alpha (TRalpha)-specific agonist. ACS Chem Biol1:585-93 (2006) 
 
Thyroid hormone receptor beta
Name:Thyroid hormone receptor beta
Type:Receptor
Mol. Mass.:52793.62
Organism:Homo sapiens (Human)
Description:Recombinant hThR was obtained from nuclear extracts from SF9 cells infected with baculovirus vectors encoding for ThRbeta 1.
Residue:461
BDBM36487
NameBDBM36487
Synonyms:CHEMBL263630 | CO23
TypeSmall organic molecule
Emp. Form.C19H18I2N2O4
Mol. Mass.592.1662
SMILESCC(C)c1cc(Oc2c(I)cc(Cc3[nH]c(=O)[nH]c3O)cc2I)ccc1O