Reaction Details
TargetThyroid hormone receptor beta
LigandBDBM36488
Substrate/Competitorn/a
Meas. Tech.Competition Binding Assay
Kd 280±102 nM
Citation Ocasio, CAScanlan, TS Design and characterization of a thyroid hormone receptor alpha (TRalpha)-specific agonist. ACS Chem Biol1:585-93 (2006) 
 
Thyroid hormone receptor beta
Name:Thyroid hormone receptor beta
Type:Receptor
Mol. Mass.:52793.62
Organism:Homo sapiens (Human)
Description:Recombinant hThR was obtained from nuclear extracts from SF9 cells infected with baculovirus vectors encoding for ThRbeta 1.
Residue:461
BDBM36488
NameBDBM36488
Synonyms:CO22
TypeSmall organic molecule
Emp. Form.C21H24N2O4
Mol. Mass.368.4263
SMILESCC(C)c1cc(Oc2c(C)cc(Cc3[nH]c(=O)[nH]c3O)cc2C)ccc1O