Reaction Details
TargetG-protein coupled estrogen receptor 1
LigandBDBM36490
Substrate/Competitorn/a
Meas. Tech.Competitive Binding Assay
Ki 25±0.0 nM
Citation Revankar, CMMitchell, HDField, ASBurai, RCorona, CRamesh, CSklar, LAArterburn, JBProssnitz, ER Synthetic estrogen derivatives demonstrate the functionality of intracellular GPR30. ACS Chem Biol2:536-44 (2007) 
 
G-protein coupled estrogen receptor 1
Name:G-protein coupled estrogen receptor 1
Type:PROTEIN
Mol. Mass.:42259.21
Organism:Homo sapiens (Human)
Description:ChEMBL_982507
Residue:375
BDBM36490
NameBDBM36490
Synonyms:E2-NH3+
TypeSmall organic molecule
Emp. Form.C27H32NO2
Mol. Mass.402.5479
SMILESC[C@]12CCC3C(CCc4cc(O)ccc34)C1CC[C@@]2(O)C#Cc1ccc(C[NH3+])cc1