Reaction Details
TargetHeat shock protein HSP 90-beta
LigandBDBM34671
Substrate/Competitorn/a
Meas. Tech.AlphaScreen Assay
Kd 492±0.0 nM
Citation Yi, FRegan, L A novel class of small molecule inhibitors of Hsp90. ACS Chem Biol3:645-54 (2008) 
 
Heat shock protein HSP 90-beta
Name:Heat shock protein HSP 90-beta
Type:Molecular Chaperone
Mol. Mass.:83229.45
Organism:Homo sapiens (Human)
Description:P08238
Residue:724
BDBM34671
NameBDBM34671
Synonyms:1,3,6-Trimethyl-1H-pyrimido[5,4-e][1,2,4]triazine-5,7-dione 1,3,6-trimethylpyrimido[5,4-e][1,2,4]triazine-5,7-quinone SMR000121073 cid_460747
TypeSmall organic molecule
Emp. Form.C8H9N5O2
Mol. Mass.207.1894
SMILESCc1nn(C)c2nc(=O)n(C)c(=O)c2n1