Reaction Details
TargetHeat shock protein HSP 90-beta
LigandBDBM36528
Substrate/Competitorn/a
Meas. Tech.AlphaScreen Assay
Kd 182±0.0 nM
Citation Yi, FRegan, L A novel class of small molecule inhibitors of Hsp90. ACS Chem Biol3:645-54 (2008) 
 
Heat shock protein HSP 90-beta
Name:Heat shock protein HSP 90-beta
Type:Molecular Chaperone
Mol. Mass.:83229.45
Organism:Homo sapiens (Human)
Description:P08238
Residue:724
BDBM36528
NameBDBM36528
Synonyms:3-benzyl-1-ethyl-6-methyl-1H,5H,6H,7H-pyrimido[5,4-e][1,2,4]triazine-5,7-dione, 13
TypeSmall organic molecule
Emp. Form.C15H15N5O2
Mol. Mass.297.3119
SMILESCCn1nc(Cc2ccccc2)nc2c1nc(=O)n(C)c2=O