Reaction Details
TargetHeat shock protein HSP 90-beta
LigandBDBM31040
Substrate/Competitorn/a
Meas. Tech.Cell Proliferation Assay
Temperature310.15±0 K
EC50 1720±0 nM
Citation Yi, FRegan, L A novel class of small molecule inhibitors of Hsp90. ACS Chem Biol3:645-54 (2008) 
 
Heat shock protein HSP 90-beta
Name:Heat shock protein HSP 90-beta
Type:Molecular Chaperone
Mol. Mass.:83229.45
Organism:Homo sapiens (Human)
Description:P08238
Residue:724
BDBM31040
NameBDBM31040
Synonyms:1-Ethyl-6-methyl-3-phenyl-1H-pyrimido[5,4-e][1,2,4]triazine-5,7-dione 1-ethyl-6-methyl-3-phenyl-pyrimido[5,4-e][1,2,4]triazine-5,7-quinone MLS000027832 US9073941, 602 | cid_647501
TypeSmall organic molecule
Emp. Form.C14H13N5O2
Mol. Mass.283.2853
SMILESCCn1nc(nc2c1nc(=O)n(C)c2=O)-c1ccccc1