Reaction Details
Target1-aminocyclopropane-1-carboxylate oxidase 1
LigandBDBM36632
Substrate/Competitorn/a
Meas. Tech.Inhibition Assay
Ki 1.8e+4±n/a nM
Citation Pirrung, MCCao, JChen, J Ethylene biosynthesis: processing of a substrate analog supports a radical mechanism for the ethylene-forming enzyme. Chem Biol5:49-57 (1998) 
 
1-aminocyclopropane-1-carboxylate oxidase 1
Name:1-aminocyclopropane-1-carboxylate oxidase 1
Type:Enzyme
Mol. Mass.:35402.01
Organism:Malus domestica (Apple) (Pyrus malus)
Description:Q00985
Residue:314
BDBM36632
NameBDBM36632
Synonyms:N-Hydroxyaminocyclobutanecarboxylic acid
TypeSmall organic molecule
Emp. Form.C5H9NO3
Mol. Mass.131.1299
SMILESO[NH2+]C1(CCC1)C([O-])=O