Reaction Details
TargetMuscle, skeletal receptor tyrosine-protein kinase
LigandBDBM25118
Substrate/Competitorn/a
Meas. Tech.Kinase Inhibitor Selectivity Profiling Assay
Kd 830±n/a nM
Citation PubChem, PC Kinase Inhibitor Selectivity Profiling Assay PubChem Bioassay(2008)[AID]
 
Muscle, skeletal receptor tyrosine-protein kinase
Name:Muscle, skeletal receptor tyrosine-protein kinase
Type:PROTEIN
Mol. Mass.:97062.85
Organism:Homo sapiens (Human)
Description:ChEMBL_1474077
Residue:869
BDBM25118
NameBDBM25118
Synonyms:(3Z)-4-amino-5-fluoro-3-[5-(4-methylpiperazino)-1,3-dihydrobenzimidazol-2-ylidene]carbostyril CHEMBL522892 | CHIR-258
TypeSmall organic molecule
Emp. Form.C21H21FN6O
Mol. Mass.392.4294
SMILESCN1CCN(CC1)c1ccc2nc([nH]c2c1)-c1c(N)c2c(F)cccc2[nH]c1=O