Reaction Details
TargetPlatelet-derived growth factor receptor alpha
LigandBDBM16673
Substrate/Competitorn/a
Meas. Tech.Kinase Inhibitor Selectivity Profiling Assay
Kd 62±n/a nM
Citation PubChem, PC Kinase Inhibitor Selectivity Profiling Assay PubChem Bioassay(2008)[AID]
 
Platelet-derived growth factor receptor alpha
Name:Platelet-derived growth factor receptor alpha
Type:Protein
Mol. Mass.:122633.38
Organism:Homo sapiens (Human)
Description:P16234
Residue:1089
BDBM16673
NameBDBM16673
Synonyms:4-[4-({[4-chloro-3-(trifluoromethyl)phenyl]carbamoyl}amino)phenoxy]-N-methylpyridine-2-carboxamide BAY 43-9006 BAY439006 Hit compound, 8 Sorafenib US10183928, Sorafenib US10227329, Compound Sorafenib US10774070, Compound Sorafenib US11279688, Compound Sorafenib US9029401, Sorafenib US9902709, Comparative example 1 cid_216239
TypeSmall organic molecule
Emp. Form.C21H16ClF3N4O3
Mol. Mass.464.825
SMILESCNC(=O)c1cc(Oc2ccc(NC(=O)Nc3ccc(Cl)c(c3)C(F)(F)F)cc2)ccn1