Reaction Details
TargetProto-oncogene tyrosine-protein kinase receptor Ret [1-999,M918T]
LigandBDBM26474
Substrate/Competitorn/a
Meas. Tech.Kinase Inhibitor Selectivity Profiling Assay
Kd 310±n/a nM
Citation PubChem, PC Kinase Inhibitor Selectivity Profiling Assay PubChem Bioassay(2008)[AID]
 
Proto-oncogene tyrosine-protein kinase receptor Ret [1-999,M918T]
Name:Proto-oncogene tyrosine-protein kinase receptor Ret [1-999,M918T]
Type:Enzyme Catalytic Domain
Mol. Mass.:111542.26
Organism:Homo sapiens (Human)
Description:P07949[1-999,M918T]
Residue:999
BDBM26474
NameBDBM26474
Synonyms:5-({4-[(2,3-dimethyl-2H-indazol-6-yl)(methyl)amino]pyrimidin-2-yl}amino)-2-methylbenzene-1-sulfonamide JMC514632 Compound 13 cid_10113978
TypeSmall organic molecule
Emp. Form.C21H23N7O2S
Mol. Mass.437.518
SMILESCN(c1ccc2c(C)n(C)nc2c1)c1ccnc(Nc2ccc(C)c(c2)S(N)(=O)=O)n1