Reaction Details
TargetProto-oncogene tyrosine-protein kinase receptor Ret [1-999,M918T]
LigandBDBM26300
Substrate/Competitorn/a
Meas. Tech.Kinase Inhibitor Selectivity Profiling Assay
Kd 120±n/a nM
Citation PubChem, PC Kinase Inhibitor Selectivity Profiling Assay PubChem Bioassay(2008)[AID]
 
Proto-oncogene tyrosine-protein kinase receptor Ret [1-999,M918T]
Name:Proto-oncogene tyrosine-protein kinase receptor Ret [1-999,M918T]
Type:Enzyme Catalytic Domain
Mol. Mass.:111542.26
Organism:Homo sapiens (Human)
Description:P07949[1-999,M918T]
Residue:999
BDBM26300
NameBDBM26300
Synonyms:2-{3-[(7-{3-[ethyl(2-hydroxyethyl)amino]propoxy}quinazolin-4-yl)amino]-1H-pyrazol-5-yl}-N-(3-fluorophenyl)acetamide cid_16007391 | pyrazoloquinazoline deriv., 34
TypeSmall organic molecule
Emp. Form.C26H30FN7O3
Mol. Mass.507.5599
SMILESCCN(CCO)CCCOc1ccc2c(Nc3cc(CC(=O)Nc4cccc(F)c4)n[nH]3)ncnc2c1