Reaction Details
TargetProto-oncogene tyrosine-protein kinase receptor Ret [1-999,M918T]
LigandBDBM13534
Substrate/Competitorn/a
Meas. Tech.Kinase Inhibitor Selectivity Profiling Assay
Kd 26±n/a nM
Citation PubChem, PC Kinase Inhibitor Selectivity Profiling Assay PubChem Bioassay(2008)[AID]
 
Proto-oncogene tyrosine-protein kinase receptor Ret [1-999,M918T]
Name:Proto-oncogene tyrosine-protein kinase receptor Ret [1-999,M918T]
Type:Enzyme Catalytic Domain
Mol. Mass.:111542.26
Organism:Homo sapiens (Human)
Description:P07949[1-999,M918T]
Residue:999
BDBM13534
NameBDBM13534
Synonyms:CHEMBL572878 N-[4-[[4-(4-methylpiperazino)-6-[(5-methyl-1H-pyrazol-3-yl)amino]pyrimidin-2-yl]thio]phenyl]cyclopropanecarboxamide VX680 | cyclopropane carboxylic acid {4-[4-(4-methyl-piperazin-1-yl)-6-(5-methyl-2H-pyrazol-3-ylamino)-pyrimidin-2ylsulphanyl]-phenyl}-amide
TypeSmall organic molecule
Emp. Form.C23H28N8OS
Mol. Mass.464.586
SMILESCN1CCN(CC1)c1cc(Nc2cc(C)n[nH]2)nc(Sc2ccc(NC(=O)C3CC3)cc2)n1