Reaction Details
TargetTyrosine-protein kinase Fyn
LigandBDBM25116
Substrate/Competitorn/a
Meas. Tech.Inhibition Assay
IC50 6±n/a nM
Citation Liu, YBishop, AWitucki, LKraybill, BShimizu, ETsien, JUbersax, JBlethrow, JMorgan, DOShokat, KM Structural basis for selective inhibition of Src family kinases by PP1. Chem Biol6:671-8 (1999) 
 
Tyrosine-protein kinase Fyn
Name:Tyrosine-protein kinase Fyn
Type:Enzyme
Mol. Mass.:60762.21
Organism:Homo sapiens (Human)
Description:P06241
Residue:537
BDBM25116
NameBDBM25116
Synonyms:1-tert-butyl-3-(4-methylphenyl)-1H-pyrazolo[3,4-d]pyrimidin-4-amine PP1 US10807986, Comparative compound 1 US11701353, PP1 (Pfizer) | cid_1400
TypeSmall organic molecule
Emp. Form.C16H19N5
Mol. Mass.281.3556
SMILESCc1ccc(cc1)-c1nn(c2ncnc(N)c12)C(C)(C)C