Reaction Details
TargetTyrosine-protein kinase Lck
LigandBDBM5446
Substrate/Competitorn/a
Meas. Tech.Kinase Inhibitor Selectivity Profiling Assay
Kd 250±n/a nM
Citation PubChem, PC Kinase Inhibitor Selectivity Profiling Assay PubChem Bioassay(2008)[AID]
 
Tyrosine-protein kinase Lck
Name:Tyrosine-protein kinase Lck
Type:n/a
Mol. Mass.:57987.83
Organism:Homo sapiens (Human)
Description:P06239
Residue:509
BDBM5446
NameBDBM5446
Synonyms:CHEMBL553 Erlotinib N-(3-Ethynylphenyl)-6,7-bis(2-methoxyethoxy)-4-quinazolinamine Monohydrochloride OSI-774 US10189853, erlotinib US11524945, Compound Erlotinib US9730934, Erlotinib cid_176870
TypeSmall organic molecule
Emp. Form.C22H23N3O4
Mol. Mass.393.4357
SMILESCOCCOc1cc2ncnc(Nc3cccc(c3)C#C)c2cc1OCCOC