Reaction Details
TargetMitogen-activated protein kinase kinase kinase 20
LigandBDBM21
Substrate/Competitorn/a
Meas. Tech.Kinase Inhibitor Selectivity Profiling Assay
Kd 5100±n/a nM
Citation PubChem, PC Kinase Inhibitor Selectivity Profiling Assay PubChem Bioassay(2008)[AID]
 
Mitogen-activated protein kinase kinase kinase 20
Name:Mitogen-activated protein kinase kinase kinase 20
Type:PROTEIN
Mol. Mass.:91168.58
Organism:Homo sapiens (Human)
Description:ChEMBL_1495629
Residue:800
BDBM21
NameBDBM21
Synonyms:CHEMBL24828 VANDETANIB ZD6474 | cid_3081361
Typen/a
Emp. Form.C22H24BrFN4O2
Mol. Mass.475.354
SMILESCOc1cc2c(Nc3ccc(Br)cc3F)ncnc2cc1OCC1CCN(C)CC1