Reaction Details
TargetIsoform 3 of Ribosomal protein S6 kinase alpha-2 (3)
LigandBDBM31096
Substrate/Competitorn/a
Meas. Tech.Kinase Inhibitor Selectivity Profiling Assay
Ki 190000±n/a nM
Citation PubChem, PC Kinase Inhibitor Selectivity Profiling Assay PubChem Bioassay(2008)[AID]
 
Isoform 3 of Ribosomal protein S6 kinase alpha-2 (3)
Name:Isoform 3 of Ribosomal protein S6 kinase alpha-2 (3)
Type:Enzyme Catalytic Domain
Mol. Mass.:84014.86
Organism:Homo sapiens (Human)
Description:gi_55743136
Residue:741
BDBM31096
NameBDBM31096
Synonyms:CHEMBL290084 cid_451705
TypeSmall organic molecule
Emp. Form.C28H26N4O3
Mol. Mass.466.531
SMILESCN[C@H]1C[C@@H]2O[C@](C)([C@H]1OC)n1c3ccccc3c3c4CNC(=O)c4c4c5ccccc5n2c4c13