Reaction Details
TargetPhosphorylase b kinase gamma catalytic chain, skeletal muscle/heart isoform
LigandBDBM21
Substrate/Competitorn/a
Meas. Tech.Kinase Inhibitor Selectivity Profiling Assay
Kd 1100±n/a nM
Citation PubChem, PC Kinase Inhibitor Selectivity Profiling Assay PubChem Bioassay(2008)[AID]
 
Phosphorylase b kinase gamma catalytic chain, skeletal muscle/heart isoform
Name:Phosphorylase b kinase gamma catalytic chain, skeletal muscle/heart isoform
Type:PROTEIN
Mol. Mass.:45025.22
Organism:Homo sapiens (Human)
Description:ChEMBL_774515
Residue:387
BDBM21
NameBDBM21
Synonyms:CHEMBL24828 VANDETANIB ZD6474 | cid_3081361
Typen/a
Emp. Form.C22H24BrFN4O2
Mol. Mass.475.354
SMILESCOc1cc2c(Nc3ccc(Br)cc3F)ncnc2cc1OCC1CCN(C)CC1