Reaction Details
Target5'-AMP-activated protein kinase catalytic subunit alpha-2
LigandBDBM25118
Substrate/Competitorn/a
Meas. Tech.Kinase Inhibitor Selectivity Profiling Assay
Kd 820±n/a nM
Citation PubChem, PC Kinase Inhibitor Selectivity Profiling Assay PubChem Bioassay(2008)[AID]
 
5'-AMP-activated protein kinase catalytic subunit alpha-2
Name:5'-AMP-activated protein kinase catalytic subunit alpha-2
Type:Enzyme
Mol. Mass.:62331.02
Organism:Homo sapiens (Human)
Description:P54646
Residue:552
BDBM25118
NameBDBM25118
Synonyms:(3Z)-4-amino-5-fluoro-3-[5-(4-methylpiperazino)-1,3-dihydrobenzimidazol-2-ylidene]carbostyril CHEMBL522892 | CHIR-258
TypeSmall organic molecule
Emp. Form.C21H21FN6O
Mol. Mass.392.4294
SMILESCN1CCN(CC1)c1ccc2nc([nH]c2c1)-c1c(N)c2c(F)cccc2[nH]c1=O